Reaction Details
TargetMitogen-activated protein kinase 7
LigandBDBM209410
Substrate/Competitorn/a
Meas. Tech.In vitro Erk5
Kd 550±n/a nM
Citation Gray, NSDeng, XKwiatkowski, NP Pyrimido-diazepinone kinase scaffold compounds and methods of treating disorders US Patent US9266890 Publication Date 2/23/2016
 
Mitogen-activated protein kinase 7
Name:Mitogen-activated protein kinase 7
Type:Protein
Mol. Mass.:88377.36
Organism:Homo sapiens (Human)
Description:Q13164
Residue:816
BDBM209410
NameBDBM209410
Synonyms:US9266890, I-20
TypeSmall organic molecule
Emp. Form.C25H28N6O
Mol. Mass.428.5294
SMILESCN1c2cnc(Nc3ccc4ncccc4c3)nc2N(C2CCCC2)[C@@H]2CCC[C@@H]2C1=O