Reaction Details
TargetMitogen-activated protein kinase 7
LigandBDBM50337128
Substrate/Competitorn/a
Meas. Tech.In vitro Erk5
Kd 57±n/a nM
Citation Gray, NSDeng, XKwiatkowski, NP Pyrimido-diazepinone kinase scaffold compounds and methods of treating disorders US Patent US9266890 Publication Date 2/23/2016
 
Mitogen-activated protein kinase 7
Name:Mitogen-activated protein kinase 7
Type:Protein
Mol. Mass.:88377.36
Organism:Homo sapiens (Human)
Description:Q13164
Residue:816
BDBM50337128
NameBDBM50337128
Synonyms:2-((4-(4-hydroxypiperidin-1-yl)-2-methoxyphenyl)amino-5,11-dimethyl-5H-benzo[e]pyrimido[5,4-b][1,4]diazepin-6(11H)-one US9266890, IV-7
TypeSmall organic molecule
Emp. Form.C25H28N6O3
Mol. Mass.460.5282
SMILESCOc1cc(ccc1Nc1ncc2N(C)C(=O)c3ccccc3N(C)c2n1)N1CCC(O)CC1