Reaction Details
TargetTyrosine-protein kinase JAK2 [809-1153]
LigandBDBM185700
Substrate/Competitorn/a
Meas. Tech.JAK Enzymatic Assay
pH7.4±n/a
IC50 17.5±n/a nM
Commentsextracted
Citation Mitton-Fry, MJBerlinski, PJBirchmeier, MJBowman, JWGonzales, AJKamerling, SGMann, DW Pyrrolo[2,3-D]pyrimidine compounds US Patent US9271981 Publication Date 3/1/2016
 
Tyrosine-protein kinase JAK2 [809-1153]
Name:Tyrosine-protein kinase JAK2 [809-1153]
Type:Protein
Mol. Mass.:37870.86
Organism:Homo sapiens (Human)
Description:ThermoFisher Scientific, Cat no. PV4210 (809-1153 aa)
Residue:324
BDBM185700
NameBDBM185700
Synonyms:US10875847, Compound Oclacitinib US9271981, 1a
TypeSmall organic molecule
Emp. Form.C15H23N5O2S
Mol. Mass.337.44
SMILESCNS(=O)(=O)C[C@H]1CC[C@@H](CC1)N(C)c1ncnc2[nH]ccc12