Reaction Details
TargetcAMP and cAMP-inhibited cGMP 3',5'-cyclic phosphodiesterase 10A
LigandBDBM209802
Substrate/Competitorn/a
Meas. Tech.PDE10 Fluorescence Polarization (FP) Assay
Temperature298.15±n/a K
Ki 0.04±n/a nM
Commentsextracted
Citation Kuduk, SDMcComas, CCReger, TS Substituted pyridone derivatives as PDE10 inhibitors US Patent US9273033 Publication Date 3/1/2016
 
cAMP and cAMP-inhibited cGMP 3',5'-cyclic phosphodiesterase 10A
Name:cAMP and cAMP-inhibited cGMP 3',5'-cyclic phosphodiesterase 10A
Type:Protein
Mol. Mass.:88412.52
Organism:Homo sapiens (Human)
Description:Q9Y233
Residue:1055
BDBM209802
NameBDBM209802
Synonyms:US9273033, 102
TypeSmall organic molecule
Emp. Form.C24H21ClN4O2
Mol. Mass.432.902
SMILESCc1ncc(c(OC[C@H]2C[C@@H]2c2ccc3ccccc3n2)n1)-c1cc(=O)n(C)cc1Cl