Reaction Details
TargetKappa-type opioid receptor
LigandBDBM209921
Substrate/Competitorn/a
Meas. Tech.[35S]GTPγS Coupling Assay
IC50 0.46±0.12 nM
Citation Schmid, CLStreicher, JMGroer, CEMunro, TAZhou, LBohn, LM Functional selectivity of 6'-guanidinonaltrindole (6'-GNTI) at kappa-opioid receptors in striatal neurons. J Biol Chem288:22387-98 (2013) 
 
Kappa-type opioid receptor
Name:Kappa-type opioid receptor
Type:G Protein-Coupled Receptor (GPCR)
Mol. Mass.:42648.76
Organism:Homo sapiens (Human)
Description:P41145
Residue:380
BDBM209921
NameBDBM209921
Synonyms:Norbinaltorphimine (nor-BNI)
TypeSmall organic molecule
Emp. Form.C40H43N3O6
Mol. Mass.661.7859
SMILESOc1ccc2C[C@H]3N(CC4CC4)CC[C@@]45[C@@H](Oc1c24)c1[nH]c2[C@@H]4Oc6c7c(C[C@@H]8N(CC9CC9)CC[C@@]47[C@@]8(O)Cc2c1C[C@@]35O)ccc6O