Reaction Details
TargetKappa-type opioid receptor
LigandBDBM209922
Substrate/Competitorn/a
Meas. Tech.[35S]GTPγS Coupling Assay
IC50 0.44±0.15 nM
Citation Schmid, CLStreicher, JMGroer, CEMunro, TAZhou, LBohn, LM Functional selectivity of 6'-guanidinonaltrindole (6'-GNTI) at kappa-opioid receptors in striatal neurons. J Biol Chem288:22387-98 (2013) 
 
Kappa-type opioid receptor
Name:Kappa-type opioid receptor
Type:G Protein-Coupled Receptor (GPCR)
Mol. Mass.:42648.76
Organism:Homo sapiens (Human)
Description:P41145
Residue:380
BDBM209922
NameBDBM209922
Synonyms:6'-Guanidinonaltrindole (6'-GNTI)
TypeSmall organic molecule
Emp. Form.C27H29N5O3
Mol. Mass.471.5509
SMILESNC(N)=Nc1ccc2c3C[C@@]4(O)[C@@H]5Cc6ccc(O)c7O[C@@H](c3[nH]c2c1)[C@]4(CCN5CC1CC1)c67