Reaction Details
Target2''-aminoglycoside nucleotidyltransferase
LigandBDBM50189123
Substrate/Competitorn/a
Meas. Tech.In Vitro ANT(2")-Ia Pyrophosphatase Assay
Ki 1.29e+4± 4.8e+3 nM
Citation Cox, GSieron, AKing, AMDe Pascale, GPawlowski, ACKoteva, KWright, GD A Common Platform for Antibiotic Dereplication and Adjuvant Discovery. Cell Chem Biol24:98-109 (2017) 
 
2''-aminoglycoside nucleotidyltransferase
Name:2''-aminoglycoside nucleotidyltransferase
Type:Protein
Mol. Mass.:19858.57
Organism:Klebsiella pneumoniae
Description:P0AE05
Residue:177
BDBM50189123
NameBDBM50189123
Synonyms:(4-benzyloxy-3-chloro-phenyl)-{6-[5-(1-oxo-1lambda*4*-thiomorpholin-4-ylmethyl)-furan-2-yl]-quinazolin-4-yl}-amine GW583373A
TypeSmall organic molecule
Emp. Form.C30H27ClN4O3S
Mol. Mass.559.078
SMILESClc1cc(Nc2ncnc3ccc(cc23)-c2ccc(CN3CCS(=O)CC3)o2)ccc1OCc1ccccc1