Reaction Details
Target2''-aminoglycoside nucleotidyltransferase
LigandBDBM50189108
Substrate/Competitorn/a
Meas. Tech.In Vitro ANT(2")-Ia Pyrophosphatase Assay
Ki 6.0e+4± 1.8e+4 nM
Citation Cox, GSieron, AKing, AMDe Pascale, GPawlowski, ACKoteva, KWright, GD A Common Platform for Antibiotic Dereplication and Adjuvant Discovery. Cell Chem Biol24:98-109 (2017) 
 
2''-aminoglycoside nucleotidyltransferase
Name:2''-aminoglycoside nucleotidyltransferase
Type:Protein
Mol. Mass.:19858.57
Organism:Klebsiella pneumoniae
Description:P0AE05
Residue:177
BDBM50189108
NameBDBM50189108
Synonyms:CHEMBL380247 N-(4-(benzyloxy)-3-chlorophenyl)-6-(5-((2-(methylsulfonyl)ethylamino)methyl)furan-2-yl)quinazolin-4-amine
TypeSmall organic molecule
Emp. Form.C29H27ClN4O4S
Mol. Mass.563.067
SMILESCS(=O)(=O)CCNCc1ccc(o1)-c1ccc2ncnc(Nc3ccc(OCc4ccccc4)c(Cl)c3)c2c1