Reaction Details
TargetAurora kinase A
LigandBDBM92830
Substrate/Competitorn/a
Meas. Tech.In Vitro Aurora A Activity Assay (DiscoverX)
pH7.4±n/a
Temperature298.15±n/a K
IC50 18.0±2.8 nM
Commentsextracted
Citation Sebti, SMSchönbrunn, ELawrence, NJLawrence, HRMartin, MP Aurora kinase inhibitors and methods of making and using thereof US Patent US9249124 Publication Date 2/2/2016
 
Aurora kinase A
Name:Aurora kinase A
Type:Serine/threonine-protein kinase
Mol. Mass.:45830.98
Organism:Homo sapiens (Human)
Description:O14965
Residue:403
BDBM92830
NameBDBM92830
Synonyms:Bisanilinopyrimidine, 9c | US9249124, 46
TypeSmall molecule
Emp. Form.C20H20ClN5O2
Mol. Mass.397.858
SMILESCOCCNC(=O)c1ccc(Nc2nccc(Nc3ccccc3Cl)n2)cc1