Reaction Details
TargetAurora kinase A
LigandBDBM87047
Substrate/Competitorn/a
Meas. Tech. Isothermal titration calorimetry (ITC)
pH7.4±n/a
IC50 10±1.6 nM
Kd 39±5.9 nM
Commentsextracted
Citation Sebti, SMSchönbrunn, ELawrence, NJLawrence, HRMartin, MP Aurora kinase inhibitors and methods of making and using thereof US Patent US9249124 Publication Date 2/2/2016
 
Aurora kinase A
Name:Aurora kinase A
Type:Serine/threonine-protein kinase
Mol. Mass.:45830.98
Organism:Homo sapiens (Human)
Description:O14965
Residue:403
BDBM87047
NameBDBM87047
Synonyms:Bisanilinopyrimidine inhibitor, 1 US9249124, 9
TypeSmall organic molecule
Emp. Form.C17H14N4O2
Mol. Mass.306.3187
SMILESOC(=O)c1ccc(Nc2nccc(Nc3ccccc3)n2)cc1