Reaction Details
TargetAurora kinase A
LigandBDBM87054
Substrate/Competitorn/a
Meas. Tech. Isothermal titration calorimetry (ITC)
pH7.4±n/a
IC50 2.1±0.4 nM
Kd 13±2.2 nM
Commentsextracted
Citation Sebti, SMSchönbrunn, ELawrence, NJLawrence, HRMartin, MP Aurora kinase inhibitors and methods of making and using thereof US Patent US9249124 Publication Date 2/2/2016
 
Aurora kinase A
Name:Aurora kinase A
Type:Serine/threonine-protein kinase
Mol. Mass.:45830.98
Organism:Homo sapiens (Human)
Description:O14965
Residue:403
BDBM87054
NameBDBM87054
Synonyms:Bisanilinopyrimidine inhibitor, 8 US9249124, 32
TypeSmall organic molecule
Emp. Form.C17H13BrN4O2
Mol. Mass.385.215
SMILESOC(=O)c1ccc(Nc2nccc(Nc3ccccc3Br)n2)cc1