Reaction Details
TargetSerine/threonine-protein kinase B-raf
LigandBDBM210021
Substrate/Competitorn/a
Meas. Tech.Raf IC50 Assay
Temperature298.15±n/a K
IC50 2.5±n/a nM
Commentsextracted
Citation Zhou, CWang, SZhang, G Fused tricyclic compounds as Raf kinase inhibitors US Patent US9273046 Publication Date 3/1/2016
 
Serine/threonine-protein kinase B-raf
Name:Serine/threonine-protein kinase B-raf
Type:Serine/threonine-protein kinase
Mol. Mass.:84446.00
Organism:Homo sapiens (Human)
Description:P15056
Residue:766
BDBM210021
NameBDBM210021
Synonyms:US10576087, Compound 2.27 US9895376, Compound 2.27
TypeSmall organic molecule
Emp. Form.C24H18N4O4
Mol. Mass.426.4241
SMILESOc1ccc2nc([nH]c2c1)C1C2Oc3ccc(Oc4ccnc5NC(=O)CCc45)cc3C12