Reaction Details
TargetRAF proto-oncogene serine/threonine-protein kinase
LigandBDBM210034
Substrate/Competitorn/a
Meas. Tech.Raf IC50 Assay
Temperature298.15±n/a K
IC50 1.4±n/a nM
Commentsextracted
Citation Zhou, CWang, SZhang, G Fused tricyclic compounds as Raf kinase inhibitors US Patent US9273046 Publication Date 3/1/2016
 
RAF proto-oncogene serine/threonine-protein kinase
Name:RAF proto-oncogene serine/threonine-protein kinase
Type:Serine/threonine-protein kinase
Mol. Mass.:73082.52
Organism:Homo sapiens (Human)
Description:P04049
Residue:648
BDBM210034
NameBDBM210034
Synonyms:US10576087, Compound 1.1 US9895376, Compound 1.1
TypeSmall organic molecule
Emp. Form.C25H20N4O2
Mol. Mass.408.4519
SMILESO=C1CCc2c(Oc3ccc4CC5C(C5c4c3)c3nc4ccccc4[nH]3)ccnc2N1