Reaction Details
TargetProstaglandin D2 receptor 2
LigandBDBM210759
Substrate/Competitorn/a
Meas. Tech.Radioligand Binding Assay
pH7.4±n/a
Temperature323.15±n/a K
Ki 5.159±n/a nM
Commentsextracted
Citation Huang, XPalani, ARao, AUZhang, HZhou, W Substituted isoquinolines as CRTH2 receptor modulators US Patent US9290454 Publication Date 3/22/2016
 
Prostaglandin D2 receptor 2
Name:Prostaglandin D2 receptor 2
Type:Enzyme
Mol. Mass.:43295.45
Organism:Homo sapiens (Human)
Description:Q9Y5Y4
Residue:395
BDBM210759
NameBDBM210759
Synonyms:US9290454, 4.4
TypeSmall organic molecule
Emp. Form.C29H26F2N2O4
Mol. Mass.504.5245
SMILESC[C@@H](NC(=O)c1ccc2c(c1)cc(CCCCC(O)=O)n(-c1ccc(F)cc1)c2=O)c1ccc(F)cc1