Reaction Details
TargetSerine/threonine-protein kinase pim-3
LigandBDBM119398
Substrate/Competitorn/a
Meas. Tech.Pim Kinase Binding Activity
pH7.2±n/a
Temperature298.15±n/a K
Ki 0.010±n/a nM
Commentsextracted
Citation Wang, X Pyrazol-4-yl-heterocyclyl-carboxamide compounds and methods of use US Patent US9573943 Publication Date 2/21/2017
 
Serine/threonine-protein kinase pim-3
Name:Serine/threonine-protein kinase pim-3
Type:Protein
Mol. Mass.:35888.19
Organism:Homo sapiens (Human)
Description:Q86V86
Residue:326
BDBM119398
NameBDBM119398
Synonyms:US8669361, 140 | US9573943, Example 140
TypeSmall organic molecule
Emp. Form.C20H23F2N7OS
Mol. Mass.447.505
SMILESCn1ncc(NC(=O)c2nc(sc2N)-c2c(F)cccc2F)c1N1CCC[C@@H](N)CC1