Reaction Details
TargetEndoplasmin
LigandBDBM210948
Substrate/Competitorn/a
Meas. Tech.Fluorescence Polarization (FP) Assay
pH7.3±n/a
Kd 1.32e+4± 1.2e+2 nM
Commentsextracted
Citation Mishra, SJGhosh, SStothert, ARDickey, CABlagg, BS Transformation of the Non-Selective Aminocyclohexanol-Based Hsp90 Inhibitor into a Grp94-Seletive Scaffold. ACS Chem Biol12:244-253 (2017) 
 
Endoplasmin
Name:Endoplasmin
Type:Protein
Mol. Mass.:92417.36
Organism:Homo sapiens (Human)
Description:P14625
Residue:803
BDBM210948
NameBDBM210948
Synonyms:2-(((1r,4r)-4-hydroxycyclohexyl)amino)-4-(2-(pyridin-4-yl)-1H-pyrrol-1-yl)benzamide (5j) | US10975030, Compound 5j
TypeSmall organic molecule
Emp. Form.C22H24N4O2
Mol. Mass.376.4516
SMILESNC(=O)c1ccc(cc1NC1CCC(O)CC1)-n1cccc1-c1ccncc1