Reaction Details
TargetGuanine nucleotide-binding protein subunit alpha-15 [Y147C]/Metabotropic glutamate receptor 2
LigandBDBM213017
Substrate/Competitorn/a
Meas. Tech.Biological Assay
IC50 10±n/a nM
Citation Bungard, CJConverso, AHanney, BHartingh, TJManley, PJMeissner, RSPerkins, JJRudd, MT Quinoline carboxamide and quinoline carbonitrile derivatives as mGluR2-negative allosteric modulators, compositions, and their use US Patent US9278960 Publication Date 3/8/2016
 
Guanine nucleotide-binding protein subunit alpha-15 [Y147C]/Metabotropic glutamate receptor 2
Name:Guanine nucleotide-binding protein subunit alpha-15 [Y147C]/Metabotropic glutamate receptor 2
Type:Protein
Mol. Mass.:n/a
Description:n/a
Components:This complex has 2 components.
Component 1
Name:Metabotropic glutamate receptor 2
Synonyms:GPRC1B GRM2_HUMAN Metabotropic glutamate receptor mGlu2 | metabotropic glutamate 2
Type:Enzyme
Mol. Mass.:95584.88
Organism:Homo sapiens (Human)
Description:Q14416
Residue:872
Component 2
Name:Guanine nucleotide-binding protein subunit alpha-15
Synonyms:G protein alpha 16 G-protein subunit alpha-16 (G alpha-16) GNA15_HUMAN Guanine nucleotide-binding protein subunit alpha-15 [Y147C]
Type:Protein
Mol. Mass.:43577.62
Organism:Homo sapiens (Human)
Description:P30679
Residue:374
BDBM213017
NameBDBM213017
Synonyms:US9278960, 4-101 US9663506, Example 4-102
TypeSmall organic molecule
Emp. Form.C23H22F4N4O
Mol. Mass.446.4406
SMILESC[C@@H]1CNC(CN1Cc1ccc2c(cc(nc2c1)C(N)=O)-c1ccc(F)cc1)C(F)(F)F