Reaction Details
TargetHistone deacetylase 2
LigandBDBM213161
Substrate/Competitorn/a
Meas. Tech.HDAC Enzyme Assay
pH7.4±n/a
Temperature298.15±n/a K
IC50 24±n/a nM
Commentsextracted
Citation van Duzer, JHMazitschek, RJones, SSYang, MTamang, DL Pyrimidine hydroxy amide compounds as histone deacetylase inhibitors US Patent US9278963 Publication Date 3/8/2016
 
Histone deacetylase 2
Name:Histone deacetylase 2
Type:Chromatin regulator; hydrolase; repressor
Mol. Mass.:55356.54
Organism:Homo sapiens (Human)
Description:Q92769
Residue:488
BDBM213161
NameBDBM213161
Synonyms:US9278963, 008
TypeSmall organic molecule
Emp. Form.C24H26N6O4
Mol. Mass.462.501
SMILESCOc1ccc(NC(=O)N2CCC(CC2)(Nc2ncc(cn2)C(=O)NO)c2ccccc2)cc1