Reaction Details
Target5'-AMP-activated protein kinase catalytic subunit alpha-2/subunit beta-1/subunit gamma-1
LigandBDBM213194
Substrate/CompetitorBDBM213211
Meas. Tech.In Vitro AMPK Activation Assay
pH7.3±n/a
EC50 5±n/a nM
Commentsextracted
Citation Apgar, JMArasappan, ABiftu, TChen, PFeng, DGuidry, EHicks, JDKekec, ALeavitt, KJLi, BMcCracken, TSebhat, IQian, XWei, LWilkening, RRWu, Z Azabenzimidazole hexahydrofuro[3,2-b]furan derivatives US Patent US9290517 Publication Date 3/22/2016
 
5'-AMP-activated protein kinase catalytic subunit alpha-2/subunit beta-1/subunit gamma-1
Name:5'-AMP-activated protein kinase catalytic subunit alpha-2/subunit beta-1/subunit gamma-1
Type:n/a
Mol. Mass.:n/a
Description:ASSAY_ID of ChEMBL is 1970361
Components:This complex has 3 components.
Component 1
Name:5'-AMP-activated protein kinase catalytic subunit alpha-2
Synonyms:AAPK2_HUMAN AMP-activated protein kinase, alpha-2 subunit AMPK subunit alpha-2 AMPK2 Hydroxymethylglutaryl-CoA reductase kinase | PRKAA2
Type:Enzyme
Mol. Mass.:62331.02
Organism:Homo sapiens (Human)
Description:P54646
Residue:552
Component 2
Name:5'-AMP-activated protein kinase subunit gamma-1
Synonyms:5'-AMP-activated protein kinase subunit gamma-1 AMP-activated protein kinase, gamma-1 subunit AMPK gamma-1 AMPK subunit gamma-1 PRKAG1
Type:n/a
Mol. Mass.:37581.44
Organism:Homo sapiens (Human)
Description:P54619
Residue:331
Component 3
Name:5'-AMP-activated protein kinase subunit beta-1
Synonyms:5'-AMP-activated protein kinase subunit beta-1 AMP-activated protein kinase alpha-2/beta-1/gamma-3 AMPK subunit beta-1 PRKAB1
Type:n/a
Mol. Mass.:30380.94
Organism:Homo sapiens (Human)
Description:Q9Y478
Residue:270
BDBM213194
BDBM213211
NameBDBM213194
Synonyms:US9290517, 105
TypeSmall organic molecule
Emp. Form.C28H29ClN4O4
Mol. Mass.521.007
SMILESCCN(CC)c1ccc(cc1)-c1ccc(cc1)-c1nc2nc(O[C@@H]3CO[C@@H]4[C@H](O)CO[C@H]34)[nH]c2cc1Cl