Reaction Details
TargetTyrosine-protein kinase ITK/TSK [357-620,Y512E]
LigandBDBM213218
Substrate/Competitorn/a
Meas. Tech.LanthaScreen Kinase Binding Assay
IC50 5.0e+2±0 nM
Citation Harling, JDDeakin, AMCampos, SGrimley, RChaudry, LNye, CPolyakova, OBessant, CMBarton, NSomers, DBarrett, JGraves, RHHanns, LKerr, WJSolari, R Discovery of novel irreversible inhibitors of interleukin (IL)-2-inducible tyrosine kinase (Itk) by targeting cysteine 442 in the ATP pocket. J Biol Chem288:28195-206 (2013) 
 
Tyrosine-protein kinase ITK/TSK [357-620,Y512E]
Name:Tyrosine-protein kinase ITK/TSK [357-620,Y512E]
Type:Enzyme
Mol. Mass.:30027.99
Organism:Homo sapiens (Human)
Description:Human Itk truncation (357-620 aa) with Y512E mutation
Residue:264
BDBM213218
NameBDBM213218
Synonyms:N2-[(3S)-1-Acryloyl-3-pyrrolidinyl]-6-(4-morpholinylmethyl)-N4-[1,3]thiazolo[5,4-b]pyridin-2-yl-2,4-pyrimidinediamine (7)
TypeSmall organic molecule
Emp. Form.C22H26N8O2S
Mol. Mass.466.559
SMILESC=CC(=O)N1CC[C@@H](C1)Nc1nc(CN2CCOCC2)cc(Nc2nc3cccnc3s2)n1