Reaction Details
TargetE3 ubiquitin-protein ligase XIAP [241-356]
LigandBDBM213374
Substrate/Competitorn/a
Meas. Tech.XIAP BIR3 & cIAP1 BIR3 Binding Assays (DELFIA)
Temperature298.15±n/a K
IC50 94±n/a nM
Commentsextracted
Citation Reiser, UMadden, J 6-Alkynyl Pyridine US Patent US9278978 Publication Date 3/8/2016
 
E3 ubiquitin-protein ligase XIAP [241-356]
Name:E3 ubiquitin-protein ligase XIAP [241-356]
Type:Protein Binding Domain
Mol. Mass.:13276.62
Organism:Homo sapiens (Human)
Description:BIR3 of XIAP: RESIDUES 241-356.
Residue:116
BDBM213374
NameBDBM213374
Synonyms:US9278978, 9
TypeSmall organic molecule
Emp. Form.C27H25N9O
Mol. Mass.491.5471
SMILESCN[C@H](C)C(=O)Nc1cc(cc(n1)C#Cc1ccc(cc1)-n1cnc(C)c1)-c1ncnc2cnn(C)c12