Reaction Details
TargetE3 ubiquitin-protein ligase XIAP [241-356]
LigandBDBM213384
Substrate/Competitorn/a
Meas. Tech.XIAP BIR3 & cIAP1 BIR3 Binding Assays (DELFIA)
Temperature298.15±n/a K
IC50 299±n/a nM
Commentsextracted
Citation Reiser, UMadden, J 6-Alkynyl Pyridine US Patent US9278978 Publication Date 3/8/2016
 
E3 ubiquitin-protein ligase XIAP [241-356]
Name:E3 ubiquitin-protein ligase XIAP [241-356]
Type:Protein Binding Domain
Mol. Mass.:13276.62
Organism:Homo sapiens (Human)
Description:BIR3 of XIAP: RESIDUES 241-356.
Residue:116
BDBM213384
NameBDBM213384
Synonyms:US9278978, 19
TypeSmall organic molecule
Emp. Form.C29H28N8O2
Mol. Mass.520.585
SMILESCN[C@H](C)C(=O)Nc1cc(cc(n1)C#Cc1ccc2n(C)c(=O)ccc2c1)-c1nc(C)nc2nn(C)c(C)c12