Reaction Details
TargetE3 ubiquitin-protein ligase XIAP [241-356]
LigandBDBM213392
Substrate/Competitorn/a
Meas. Tech.XIAP BIR3 & cIAP1 BIR3 Binding Assays (DELFIA)
Temperature298.15±n/a K
IC50 99±n/a nM
Commentsextracted
Citation Reiser, UMadden, J 6-Alkynyl Pyridine US Patent US9278978 Publication Date 3/8/2016
 
E3 ubiquitin-protein ligase XIAP [241-356]
Name:E3 ubiquitin-protein ligase XIAP [241-356]
Type:Protein Binding Domain
Mol. Mass.:13276.62
Organism:Homo sapiens (Human)
Description:BIR3 of XIAP: RESIDUES 241-356.
Residue:116
BDBM213392
NameBDBM213392
Synonyms:US9278978, 27
TypeSmall organic molecule
Emp. Form.C27H24N4O2
Mol. Mass.436.5051
SMILESCN[C@H](C)C(=O)Nc1cc(c(OC)c(n1)C#Cc1ccccc1)-c1cccc2ncccc12