Reaction Details
TargetE3 ubiquitin-protein ligase XIAP [241-356]
LigandBDBM213401
Substrate/Competitorn/a
Meas. Tech.XIAP BIR3 & cIAP1 BIR3 Binding Assays (DELFIA)
Temperature298.15±n/a K
IC50 100±n/a nM
Commentsextracted
Citation Reiser, UMadden, J 6-Alkynyl Pyridine US Patent US9278978 Publication Date 3/8/2016
 
E3 ubiquitin-protein ligase XIAP [241-356]
Name:E3 ubiquitin-protein ligase XIAP [241-356]
Type:Protein Binding Domain
Mol. Mass.:13276.62
Organism:Homo sapiens (Human)
Description:BIR3 of XIAP: RESIDUES 241-356.
Residue:116
BDBM213401
NameBDBM213401
Synonyms:US9278978, 36
TypeSmall organic molecule
Emp. Form.C26H22N6O
Mol. Mass.434.4925
SMILESCNC(C)C(=O)Nc1cc(-c2cccnc2)c(-c2cncnc2)c(n1)C#Cc1ccccc1