Reaction Details
TargetBaculoviral IAP repeat-containing protein 2 [256-363]
LigandBDBM213380
Substrate/Competitorn/a
Meas. Tech.XIAP BIR3 & cIAP1 BIR3 Binding Assays (DELFIA)
Temperature298.15±n/a K
IC50 1±n/a nM
Commentsextracted
Citation Reiser, UMadden, J 6-Alkynyl Pyridine US Patent US9278978 Publication Date 3/8/2016
 
Baculoviral IAP repeat-containing protein 2 [256-363]
Name:Baculoviral IAP repeat-containing protein 2 [256-363]
Type:Enzyme
Mol. Mass.:12600.71
Organism:Homo sapiens (Human)
Description:Human cIAP BIR3 domain (256-363 aa)
Residue:108
BDBM213380
NameBDBM213380
Synonyms:US9278978, 15
TypeSmall organic molecule
Emp. Form.C29H28N8O2
Mol. Mass.520.585
SMILESCN[C@H](C)C(=O)Nc1cc(cc(n1)C#Cc1ccc2n(C)c(=O)ccc2c1)-c1nc(C)nc2c(C)nn(C)c12