Reaction Details
TargetIsoform Tau-F of Microtubule-associated protein tau
LigandBDBM32299
Substrate/Competitorn/a
Meas. Tech.Tau Protein Assay
pH7.4±n/a
IC50 2.9e+2± 2e+1 nM
Commentsextracted
Citation Schafer, KNCisek, KHuseby, CJChang, EKuret, J Structural determinants of Tau aggregation inhibitor potency. J Biol Chem288:32599-611 (2013) 
 
Isoform Tau-F of Microtubule-associated protein tau
Name:Isoform Tau-F of Microtubule-associated protein tau
Type:Enzyme Catalytic Domain
Mol. Mass.:45857.42
Organism:Homo sapiens (Human)
Description:P10636-8
Residue:441
BDBM32299
NameBDBM32299
Synonyms:2-[(2Z)-2-[(2E)-2-[[3-(2-hydroxyethyl)-5-methoxy-1,3-benzothiazol-3-ium-2-yl]methylidene]butylidene]-5-methoxy-1,3-benzothiazol-3-yl]ethanol;chloride 3-(2-Hydroxy-ethyl)-2-{2-[3-(2-hydroxy-ethyl)-5-methoxy-3H-benzothiazol-2-ylidenemethyl]-but-1-enyl}-5-methoxy-benzothiazol-3-ium Cyanines, 2 SMR000175124 | cid_12004742
TypeSmall organic molecule
Emp. Form.C25H29N2O4S2
Mol. Mass.485.638
SMILESCC\C(=C/c1sc2ccc(OC)cc2[n+]1CCO)\C=C1/Sc2ccc(OC)cc2N1CCO