Reaction Details
TargetIsoform Tau-F of Microtubule-associated protein tau
LigandBDBM214723
Substrate/Competitorn/a
Meas. Tech.Tau Protein Assay
pH7.4±n/a
IC50 8.9e+2± 2.0e+2 nM
Commentsextracted
Citation Schafer, KNCisek, KHuseby, CJChang, EKuret, J Structural determinants of Tau aggregation inhibitor potency. J Biol Chem288:32599-611 (2013) 
 
Isoform Tau-F of Microtubule-associated protein tau
Name:Isoform Tau-F of Microtubule-associated protein tau
Type:Enzyme Catalytic Domain
Mol. Mass.:45857.42
Organism:Homo sapiens (Human)
Description:P10636-8
Residue:441
BDBM214723
NameBDBM214723
Synonyms:Cyanines, 3
TypeSmall organic molecule
Emp. Form.C25H25N2
Mol. Mass.353.4789
SMILESCCN1\C(=C\C=C\c2ccc3ccccc3[n+]2CC)C=Cc2ccccc12