Reaction Details
TargetIsoform Tau-F of Microtubule-associated protein tau
LigandBDBM50387480
Substrate/Competitorn/a
Meas. Tech.Tau Protein Assay
pH7.4±n/a
IC50 9.8e+2± 3.5e+2 nM
Commentsextracted
Citation Schafer, KNCisek, KHuseby, CJChang, EKuret, J Structural determinants of Tau aggregation inhibitor potency. J Biol Chem288:32599-611 (2013) 
 
Isoform Tau-F of Microtubule-associated protein tau
Name:Isoform Tau-F of Microtubule-associated protein tau
Type:Enzyme Catalytic Domain
Mol. Mass.:45857.42
Organism:Homo sapiens (Human)
Description:P10636-8
Residue:441
BDBM50387480
NameBDBM50387480
Synonyms:CHEMBL467894 | Cyanines, 5
TypeSmall organic molecule
Emp. Form.C27H33N2
Mol. Mass.385.5638
SMILESCCN1\C(=C\C=C\C2=[N+](CC)c3ccccc3C2(C)C)C(C)(C)c2ccccc12