Reaction Details
TargetIsoform Tau-F of Microtubule-associated protein tau
LigandBDBM214740
Substrate/Competitorn/a
Meas. Tech.Tau Protein Assay
pH7.4±n/a
IC50 4.7e+2±n/a nM
Commentsextracted
Citation Schafer, KNCisek, KHuseby, CJChang, EKuret, J Structural determinants of Tau aggregation inhibitor potency. J Biol Chem288:32599-611 (2013) 
 
Isoform Tau-F of Microtubule-associated protein tau
Name:Isoform Tau-F of Microtubule-associated protein tau
Type:Enzyme Catalytic Domain
Mol. Mass.:45857.42
Organism:Homo sapiens (Human)
Description:P10636-8
Residue:441
BDBM214740
NameBDBM214740
Synonyms:Rhodanines, 28A
TypeSmall organic molecule
Emp. Form.C17H11ClNO4S2
Mol. Mass.392.857
SMILES[O-]C(=O)CCN1C(=S)S\C(=C/c2ccc(o2)-c2cccc(Cl)c2)C1=O