Reaction Details
TargetIsoform Tau-F of Microtubule-associated protein tau
LigandBDBM214742
Substrate/Competitorn/a
Meas. Tech.Tau Protein Assay
pH7.4±n/a
IC50 5.8e+2±n/a nM
Commentsextracted
Citation Schafer, KNCisek, KHuseby, CJChang, EKuret, J Structural determinants of Tau aggregation inhibitor potency. J Biol Chem288:32599-611 (2013) 
 
Isoform Tau-F of Microtubule-associated protein tau
Name:Isoform Tau-F of Microtubule-associated protein tau
Type:Enzyme Catalytic Domain
Mol. Mass.:45857.42
Organism:Homo sapiens (Human)
Description:P10636-8
Residue:441
BDBM214742
NameBDBM214742
Synonyms:Rhodanines, 30A
TypeSmall organic molecule
Emp. Form.C28H17NO7S2
Mol. Mass.543.568
SMILES[O-]C(=O)Cc1ccc(CN2C(=S)S\C(=C/c3ccc(o3)-c3ccc(cc3)-c3ccc(o3)C([O-])=O)C2=O)cc1