Reaction Details
TargetIsoform Tau-F of Microtubule-associated protein tau
LigandBDBM214749
Substrate/Competitorn/a
Meas. Tech.Tau Protein Assay
pH7.4±n/a
IC50 9.4e+2±n/a nM
Commentsextracted
Citation Schafer, KNCisek, KHuseby, CJChang, EKuret, J Structural determinants of Tau aggregation inhibitor potency. J Biol Chem288:32599-611 (2013) 
 
Isoform Tau-F of Microtubule-associated protein tau
Name:Isoform Tau-F of Microtubule-associated protein tau
Type:Enzyme Catalytic Domain
Mol. Mass.:45857.42
Organism:Homo sapiens (Human)
Description:P10636-8
Residue:441
BDBM214749
NameBDBM214749
Synonyms:Rhodanines, 37A
TypeSmall organic molecule
Emp. Form.C24H18NO4S2
Mol. Mass.448.535
SMILES[O-]C(=O)CCCN1C(=S)S\C(=C/c2ccc(o2)-c2ccc(cc2)-c2ccccc2)C1=O