Reaction Details
TargetIsoform Tau-F of Microtubule-associated protein tau
LigandBDBM214766
Substrate/Competitorn/a
Meas. Tech.Tau Protein Assay
pH7.4±n/a
IC50 7.70e+3±n/a nM
Commentsextracted
Citation Schafer, KNCisek, KHuseby, CJChang, EKuret, J Structural determinants of Tau aggregation inhibitor potency. J Biol Chem288:32599-611 (2013) 
 
Isoform Tau-F of Microtubule-associated protein tau
Name:Isoform Tau-F of Microtubule-associated protein tau
Type:Enzyme Catalytic Domain
Mol. Mass.:45857.42
Organism:Homo sapiens (Human)
Description:P10636-8
Residue:441
BDBM214766
NameBDBM214766
Synonyms:Rhodanines, 54A
TypeSmall organic molecule
Emp. Form.C25H19N3O2S2
Mol. Mass.457.567
SMILESO=C1N(CCc2c[nH]cn2)C(=S)S\C1=C/c1ccc(o1)-c1ccc(cc1)-c1ccccc1