Reaction Details
TargetIsoform Tau-F of Microtubule-associated protein tau
LigandBDBM214767
Substrate/Competitorn/a
Meas. Tech.Tau Protein Assay
pH7.4±n/a
IC50 7.92e+3±n/a nM
Commentsextracted
Citation Schafer, KNCisek, KHuseby, CJChang, EKuret, J Structural determinants of Tau aggregation inhibitor potency. J Biol Chem288:32599-611 (2013) 
 
Isoform Tau-F of Microtubule-associated protein tau
Name:Isoform Tau-F of Microtubule-associated protein tau
Type:Enzyme Catalytic Domain
Mol. Mass.:45857.42
Organism:Homo sapiens (Human)
Description:P10636-8
Residue:441
BDBM214767
NameBDBM214767
Synonyms:Rhodanines, 55A
TypeSmall organic molecule
Emp. Form.C24H17NO3S2
Mol. Mass.431.527
SMILES[O-]C(=O)CCN1C(=S)S\C(=C/c2ccc(c2)-c2ccc(cc2)-c2ccccc2)C1=O