Reaction Details
TargetPoly [ADP-ribose] polymerase 1
LigandBDBM214493
Substrate/Competitorn/a
Meas. Tech.PARP Enzyme Inhibition Assay
pH8±n/a
Ki 0.7±n/a nM
Commentsextracted
Citation Gandhi, VBGiranda, VLGong, JPenning, TDZhu, G Inhibitors of poly(ADP-ribose)polymerase US Patent US9283222 Publication Date 3/15/2016
 
Poly [ADP-ribose] polymerase 1
Name:Poly [ADP-ribose] polymerase 1
Type:n/a
Mol. Mass.:113114.22
Organism:Homo sapiens (Human)
Description:P09874
Residue:1014
BDBM214493
NameBDBM214493
Synonyms:US9283222, 600
TypeSmall organic molecule
Emp. Form.C26H28FN5O5S
Mol. Mass.541.594
SMILESCOc1ccc(cc1)S(=O)(=O)N1CCN(CC1)C(=O)c1cc(Cc2n[nH]c(=O)c3CCCNc23)ccc1F