Reaction Details
TargetPoly [ADP-ribose] polymerase 1
LigandBDBM50387935
Substrate/Competitorn/a
Meas. Tech.PARP Enzyme Inhibition Assay
pH8±n/a
Ki 0.9±n/a nM
Commentsextracted
Citation Gandhi, VBGiranda, VLGong, JPenning, TDZhu, G Inhibitors of poly(ADP-ribose)polymerase US Patent US9283222 Publication Date 3/15/2016
 
Poly [ADP-ribose] polymerase 1
Name:Poly [ADP-ribose] polymerase 1
Type:n/a
Mol. Mass.:113114.22
Organism:Homo sapiens (Human)
Description:P09874
Residue:1014
BDBM50387935
NameBDBM50387935
Synonyms:CHEMBL2058916 | US9283222, 607
TypeSmall organic molecule
Emp. Form.C19H20FN5O3
Mol. Mass.385.3922
SMILESFc1ccc(Cc2n[nH]c(=O)c3CCCNc23)cc1C(=O)N1CCNC(=O)C1