Reaction Details
TargetPoly [ADP-ribose] polymerase 1
LigandBDBM214526
Substrate/Competitorn/a
Meas. Tech.PARP Enzyme Inhibition Assay
pH8±n/a
Ki 0.7±n/a nM
Commentsextracted
Citation Gandhi, VBGiranda, VLGong, JPenning, TDZhu, G Inhibitors of poly(ADP-ribose)polymerase US Patent US9283222 Publication Date 3/15/2016
 
Poly [ADP-ribose] polymerase 1
Name:Poly [ADP-ribose] polymerase 1
Type:n/a
Mol. Mass.:113114.22
Organism:Homo sapiens (Human)
Description:P09874
Residue:1014
BDBM214526
NameBDBM214526
Synonyms:US9283222, 640
TypeSmall organic molecule
Emp. Form.C25H30FN5O3
Mol. Mass.467.5358
SMILESFc1ccc(Cc2n[nH]c(=O)c3CCCNc23)cc1C(=O)N1CCN(CC1)C(=O)C1CCCC1