Reaction Details
TargetPoly [ADP-ribose] polymerase 1
LigandBDBM214629
Substrate/Competitorn/a
Meas. Tech.PARP Enzyme Inhibition Assay
pH8±n/a
Ki 0.3±n/a nM
Commentsextracted
Citation Gandhi, VBGiranda, VLGong, JPenning, TDZhu, G Inhibitors of poly(ADP-ribose)polymerase US Patent US9283222 Publication Date 3/15/2016
 
Poly [ADP-ribose] polymerase 1
Name:Poly [ADP-ribose] polymerase 1
Type:n/a
Mol. Mass.:113114.22
Organism:Homo sapiens (Human)
Description:P09874
Residue:1014
BDBM214629
NameBDBM214629
Synonyms:US9283222, 759
TypeSmall organic molecule
Emp. Form.C21H23FN4O3
Mol. Mass.398.4307
SMILESCN1CCN(CC1=O)C(=O)c1cc(Cc2n[nH]c(=O)c3CCCCc23)ccc1F