Reaction Details
TargetMonocarboxylate transporter 1
LigandBDBM50092077
Substrate/Competitorn/a
Meas. Tech.Inhibition Assay
pH7.43±n/a
Temperature310.15±n/a K
IC50 340±n/a nM
Commentsextracted
Citation Mereddy, VRDrewes, LRAlam, MAJonnalagadda, SKGurrapu, S Therapeutic compounds US Patent US9296728 Publication Date 3/29/2016
 
Monocarboxylate transporter 1
Name:Monocarboxylate transporter 1
Type:Enzyme
Mol. Mass.:53245.17
Organism:Rattus norvegicus (Rat)
Description:P53987
Residue:494
BDBM50092077
NameBDBM50092077
Synonyms:CHEMBL3582414 | US9296728, 8
TypeSmall organic molecule
Emp. Form.C16H12N2O2
Mol. Mass.264.2787
SMILESOC(=O)C(=C\c1ccc(cc1)N(CC#C)CC#C)\C#N