Reaction Details
TargetMonocarboxylate transporter 1
LigandBDBM50092071
Substrate/Competitorn/a
Meas. Tech.Inhibition Assay
pH7.43±n/a
Temperature310.15±n/a K
IC50 15±n/a nM
Commentsextracted
Citation Mereddy, VRDrewes, LRAlam, MAJonnalagadda, SKGurrapu, S Therapeutic compounds US Patent US9296728 Publication Date 3/29/2016
 
Monocarboxylate transporter 1
Name:Monocarboxylate transporter 1
Type:Enzyme
Mol. Mass.:53245.17
Organism:Rattus norvegicus (Rat)
Description:P53987
Residue:494
BDBM50092071
NameBDBM50092071
Synonyms:CHEMBL3582420 | US9296728, 18
TypeSmall organic molecule
Emp. Form.C19H26N2O3
Mol. Mass.330.4213
SMILESCOc1cc(ccc1\C=C(/C#N)C(O)=O)N(CC(C)C)CC(C)C