Reaction Details
TargetMonocarboxylate transporter 1
LigandBDBM214703
Substrate/Competitorn/a
Meas. Tech.Inhibition Assay
pH7.43±n/a
Temperature310.15±n/a K
IC50 200±n/a nM
Commentsextracted
Citation Mereddy, VRDrewes, LRAlam, MAJonnalagadda, SKGurrapu, S Therapeutic compounds US Patent US9296728 Publication Date 3/29/2016
 
Monocarboxylate transporter 1
Name:Monocarboxylate transporter 1
Type:Enzyme
Mol. Mass.:53245.17
Organism:Rattus norvegicus (Rat)
Description:P53987
Residue:494
BDBM214703
NameBDBM214703
Synonyms:US9296728, 27
TypeSmall organic molecule
Emp. Form.C24H17F2NO4
Mol. Mass.421.3929
SMILESOC(=O)c1cc2ccc(cc2oc1=O)N(Cc1ccc(F)cc1)Cc1ccc(F)cc1