Reaction Details
TargetSolute carrier organic anion transporter family member
LigandBDBM17292
Substrate/Competitorn/a
Meas. Tech.Oatp1d1 Transport Assay
Ki 2.83e+3±n/a nM
Citation Popovic, MZaja, RFent, KSmital, T Molecular characterization of zebrafish Oatp1d1 (Slco1d1), a novel organic anion-transporting polypeptide. J Biol Chem288:33894-911 (2013) 
 
Solute carrier organic anion transporter family member
Name:Solute carrier organic anion transporter family member
Synonyms:Organic anion-transporting polypeptide 1D1 (Oatp1d1)
Type:Protein
Mol. Mass.:75011.81
Organism:Danio rerio (Zebrafish)
Description:A0A8M9PU70
Residue:689
BDBM17292
NameBDBM17292
TypeSteroid
Emp. Form.C18H24O2
Mol. Mass.272.382
SMILES[H][C@@]12CC[C@H](O)[C@@]1(C)CC[C@]1([H])c3ccc(O)cc3CC[C@@]21[H]