Reaction Details
TargetSolute carrier organic anion transporter family member
LigandBDBM35847
Substrate/Competitorn/a
Meas. Tech.Oatp1d1 Transport Assay
Ki 2.27e+5±n/a nM
Citation Popovic, MZaja, RFent, KSmital, T Molecular characterization of zebrafish Oatp1d1 (Slco1d1), a novel organic anion-transporting polypeptide. J Biol Chem288:33894-911 (2013) 
 
Solute carrier organic anion transporter family member
Name:Solute carrier organic anion transporter family member
Synonyms:Organic anion-transporting polypeptide 1D1 (Oatp1d1)
Type:Protein
Mol. Mass.:75011.81
Organism:Danio rerio (Zebrafish)
Description:A0A8M9PU70
Residue:689
BDBM35847
NameBDBM35847
Typeradiolabeled ligand
Emp. Form.C20H32O5
Mol. Mass.352.4651
SMILESCCCCC[C@H](O)\C=C\[C@H]1[C@H](O)CC(=O)[C@@H]1C\C=C/CCCC(O)=O