Reaction Details
TargetSolute carrier organic anion transporter family member
LigandBDBM28701
Substrate/Competitorn/a
Meas. Tech.Oatp1d1 Transport Assay
Ki 4.04e+4±n/a nM
Citation Popovic, MZaja, RFent, KSmital, T Molecular characterization of zebrafish Oatp1d1 (Slco1d1), a novel organic anion-transporting polypeptide. J Biol Chem288:33894-911 (2013) 
 
Solute carrier organic anion transporter family member
Name:Solute carrier organic anion transporter family member
Synonyms:Organic anion-transporting polypeptide 1D1 (Oatp1d1)
Type:Protein
Mol. Mass.:75011.81
Organism:Danio rerio (Zebrafish)
Description:A0A8M9PU70
Residue:689
BDBM28701
NameBDBM28701
TypeSmall organic molecule
Emp. Form.C19H20ClNO4
Mol. Mass.361.819
SMILESCC(C)(Oc1ccc(CCNC(=O)c2ccc(Cl)cc2)cc1)C(O)=O