Reaction Details
TargetTrans-sialidase [3-643,Y342H]
LigandBDBM50048093
Substrate/CompetitorBDBM217358
Meas. Tech.Diffusion Ordered Spectroscopy (DOSY)
Temperature284.15±n/a K
Kd 5.2e+4± 2e+3 nM
Commentsextracted
Citation Oliveira, IAGonçalves, ASNeves, JLvon Itzstein, MTodeschini, AR Evidence of ternary complex formation in Trypanosoma cruzi trans-sialidase catalysis. J Biol Chem289:423-36 (2014) 
 
Trans-sialidase [3-643,Y342H]
Name:Trans-sialidase [3-643,Y342H]
Synonyms:trans-Sialidase (TS Y342H)
Type:Enzyme
Mol. Mass.:70283.70
Organism:Trypanosoma cruzi
Description:T. cruzi TS Y342H mutant
Residue:641
BDBM50048093
BDBM217358
NameBDBM50048093
TypeSmall organic molecule
Emp. Form.C13H24O11
Mol. Mass.356.3231
SMILESCO[C@@H]1O[C@H](CO)[C@@H](O[C@@H]2O[C@H](CO)[C@H](O)[C@H](O)[C@H]2O)[C@H](O)[C@H]1O