Reaction Details
TargetGhrelin O-acyltransferase
LigandBDBM80086
Substrate/Competitorn/a
Meas. Tech.GOAT Activity Assay
pH7±n/a
Temperature298.15±n/a K
IC50 3.8e+4± 6e+3 nM
Commentsextracted
Citation McGovern-Gooch, KRMahajani, NSGaragozzo, ASchramm, AJHannah, LGSieburg, MAChisholm, JDHougland, JL Synthetic Triterpenoid Inhibition of Human Ghrelin O-Acyltransferase: The Involvement of a Functionally Required Cysteine Provides Mechanistic Insight into Ghrelin Acylation. Biochemistry56:919-931 (2017) 
 
Ghrelin O-acyltransferase
Name:Ghrelin O-acyltransferase
Type:Enzyme
Mol. Mass.:49733.10
Organism:Homo sapiens (Human)
Description:Q96T53
Residue:435
BDBM80086
NameBDBM80086
Synonyms:(4aR,6aR,6aS,6bR,8aS,12aS,14bS)-8a-(imidazole-1-carbonyl)-3,13-diketo-4,4,6a,6b,11,11,14b-heptamethyl-4a,5,6,6a,7,8,9,10,12,12a-decahydropicene-2-carbonitrile (4aR,6aR,6aS,6bR,8aS,12aS,14bS)-8a-[1-imidazolyl(oxo)methyl]-4,4,6a,6b,11,11,14b-heptamethyl-3,13-dioxo-4a,5,6,6a,7,8,9,10,12,12a-decahydropicene-2-carbonitrile CDDO-Im, 1 SMR001566062 | cid_9958995
TypeSmall organic molecule
Emp. Form.C34H43N3O3
Mol. Mass.541.7235
SMILESCC1(C)CC[C@@]2(CC[C@]3(C)[C@@H]([C@@H]2C1)C(=O)C=C1[C@@]2(C)C=C(C#N)C(=O)C(C)(C)[C@@H]2CC[C@@]31C)C(=O)n1ccnc1