Reaction Details
TargetGhrelin O-acyltransferase
LigandBDBM50096348
Substrate/Competitorn/a
Meas. Tech.GOAT Activity Assay
pH7±n/a
Temperature298.15±n/a K
IC50>1.00e+5±n/a nM
Commentsextracted
Citation McGovern-Gooch, KRMahajani, NSGaragozzo, ASchramm, AJHannah, LGSieburg, MAChisholm, JDHougland, JL Synthetic Triterpenoid Inhibition of Human Ghrelin O-Acyltransferase: The Involvement of a Functionally Required Cysteine Provides Mechanistic Insight into Ghrelin Acylation. Biochemistry56:919-931 (2017) 
 
Ghrelin O-acyltransferase
Name:Ghrelin O-acyltransferase
Type:Enzyme
Mol. Mass.:49733.10
Organism:Homo sapiens (Human)
Description:Q96T53
Residue:435
BDBM50096348
NameBDBM50096348
Synonyms:2-Cyano-3,12-Dioxooleana-1,9(11)-Dien-28-Oic Acid CDDO RTA-401
TypeSmall organic molecule
Emp. Form.C31H41NO4
Mol. Mass.491.6615
SMILES[H][C@@]12CC(C)(C)CC[C@@]1(CC[C@]1(C)[C@]2([H])C(=O)C=C2[C@@]1(C)CC[C@@]1([H])C(C)(C)C(=O)C(=C[C@]21C)C#N)C(O)=O