Reaction Details
TargetGhrelin O-acyltransferase
LigandBDBM217386
Substrate/Competitorn/a
Meas. Tech.GOAT Activity Assay
pH7±n/a
Temperature298.15±n/a K
IC50 1.70e+5± 6.0e+4 nM
Commentsextracted
Citation McGovern-Gooch, KRMahajani, NSGaragozzo, ASchramm, AJHannah, LGSieburg, MAChisholm, JDHougland, JL Synthetic Triterpenoid Inhibition of Human Ghrelin O-Acyltransferase: The Involvement of a Functionally Required Cysteine Provides Mechanistic Insight into Ghrelin Acylation. Biochemistry56:919-931 (2017) 
 
Ghrelin O-acyltransferase
Name:Ghrelin O-acyltransferase
Type:Enzyme
Mol. Mass.:49733.10
Organism:Homo sapiens (Human)
Description:Q96T53
Residue:435
BDBM217386
NameBDBM217386
Synonyms:Steroid scaffold, 11
TypeSmall organic molecule
Emp. Form.C19H28O
Mol. Mass.272.425
SMILESC[C@@]12CCC[C@H]1[C@@H]1CC[C@H]3CC(=O)C=C[C@]3(C)[C@H]1CC2