Reaction Details
TargetGhrelin O-acyltransferase
LigandBDBM217387
Substrate/Competitorn/a
Meas. Tech.GOAT Activity Assay
pH7±n/a
Temperature298.15±n/a K
IC50>4.00e+5±n/a nM
Commentsextracted
Citation McGovern-Gooch, KRMahajani, NSGaragozzo, ASchramm, AJHannah, LGSieburg, MAChisholm, JDHougland, JL Synthetic Triterpenoid Inhibition of Human Ghrelin O-Acyltransferase: The Involvement of a Functionally Required Cysteine Provides Mechanistic Insight into Ghrelin Acylation. Biochemistry56:919-931 (2017) 
 
Ghrelin O-acyltransferase
Name:Ghrelin O-acyltransferase
Type:Enzyme
Mol. Mass.:49733.10
Organism:Homo sapiens (Human)
Description:Q96T53
Residue:435
BDBM217387
NameBDBM217387
Synonyms:Steroid scaffold, 12
TypeSmall organic molecule
Emp. Form.C19H30O
Mol. Mass.274.4409
SMILESC[C@@]12CCC[C@H]1[C@@H]1CC[C@H]3CC(=O)CC[C@]3(C)[C@H]1CC2