Reaction Details
TargetGhrelin O-acyltransferase
LigandBDBM217390
Substrate/Competitorn/a
Meas. Tech.GOAT Activity Assay
pH7±n/a
Temperature298.15±n/a K
IC50 5.00e+5± 1.00e+5 nM
Commentsextracted
Citation McGovern-Gooch, KRMahajani, NSGaragozzo, ASchramm, AJHannah, LGSieburg, MAChisholm, JDHougland, JL Synthetic Triterpenoid Inhibition of Human Ghrelin O-Acyltransferase: The Involvement of a Functionally Required Cysteine Provides Mechanistic Insight into Ghrelin Acylation. Biochemistry56:919-931 (2017) 
 
Ghrelin O-acyltransferase
Name:Ghrelin O-acyltransferase
Type:Enzyme
Mol. Mass.:49733.10
Organism:Homo sapiens (Human)
Description:Q96T53
Residue:435
BDBM217390
NameBDBM217390
Synonyms:2-Bromo-2-cyclohexenone, 17
TypeSmall organic molecule
Emp. Form.C6H7BrO
Mol. Mass.175.023
SMILESBrC1=CCCCC1=O