Reaction Details
TargetGhrelin O-acyltransferase
LigandBDBM217391
Substrate/Competitorn/a
Meas. Tech.GOAT Activity Assay
pH7±n/a
Temperature298.15±n/a K
IC50>1.000e+6±n/a nM
Commentsextracted
Citation McGovern-Gooch, KRMahajani, NSGaragozzo, ASchramm, AJHannah, LGSieburg, MAChisholm, JDHougland, JL Synthetic Triterpenoid Inhibition of Human Ghrelin O-Acyltransferase: The Involvement of a Functionally Required Cysteine Provides Mechanistic Insight into Ghrelin Acylation. Biochemistry56:919-931 (2017) 
 
Ghrelin O-acyltransferase
Name:Ghrelin O-acyltransferase
Type:Enzyme
Mol. Mass.:49733.10
Organism:Homo sapiens (Human)
Description:Q96T53
Residue:435
BDBM217391
NameBDBM217391
Synonyms:Cyclohexenone, 18
TypeSmall organic molecule
Emp. Form.C6H8O
Mol. Mass.96.1271
SMILESO=C1CCCC=C1